Reaction Details
TargetHistone deacetylase 2
LigandBDBM50297446
Substrate/Competitorn/a
Meas. Tech.ChEMBL_585885 (CHEMBL1053556)
IC50 590.00±n/a nM
Citation Giannini, GMarzi, MMarzo, MDBattistuzzi, GPezzi, RBrunetti, TCabri, WVesci, LPisano, C Exploring bis-(indolyl)methane moiety as an alternative and innovative CAP group in the design of histone deacetylase (HDAC) inhibitors. Bioorg Med Chem Lett19:2840-3 (2009) 
 
Histone deacetylase 2
Name:Histone deacetylase 2
Type:Chromatin regulator; hydrolase; repressor
Mol. Mass.:55356.54
Organism:Homo sapiens (Human)
Description:Q92769
Residue:488
BDBM50297446
NameBDBM50297446
Synonyms:CHEMBL561604 ST-5732
TypeSmall organic molecule
Emp. Form.C23H23N5O6
Mol. Mass.465.4586
SMILESONC(=O)CCCCCC(c1c[nH]c2ccc(cc12)[N+]([O-])=O)c1c[nH]c2ccc(cc12)[N+]([O-])=O