Reaction Details
TargetHistone deacetylase 3
LigandBDBM50297445
Substrate/Competitorn/a
Meas. Tech.ChEMBL_585886 (CHEMBL1053557)
IC50 23.00±n/a nM
Citation Giannini, GMarzi, MMarzo, MDBattistuzzi, GPezzi, RBrunetti, TCabri, WVesci, LPisano, C Exploring bis-(indolyl)methane moiety as an alternative and innovative CAP group in the design of histone deacetylase (HDAC) inhibitors. Bioorg Med Chem Lett19:2840-3 (2009) 
 
Histone deacetylase 3
Name:Histone deacetylase 3
Type:Enzyme
Mol. Mass.:48829.55
Organism:Homo sapiens (Human)
Description:O15379
Residue:428
BDBM50297445
NameBDBM50297445
Synonyms:CHEMBL561483 | N-hydroxy-7,7-bis(7-methoxy-1H-indol-3-yl)heptanamide
TypeSmall organic molecule
Emp. Form.C25H29N3O4
Mol. Mass.435.5155
SMILESCOc1cccc2c(c[nH]c12)C(CCCCCC(=O)NO)c1c[nH]c2c(OC)cccc12