Reaction Details
TargetHistone deacetylase 5
LigandBDBM50297447
Substrate/Competitorn/a
Meas. Tech.ChEMBL_585888 (CHEMBL1053559)
IC50 4900.00±n/a nM
Citation Giannini, GMarzi, MMarzo, MDBattistuzzi, GPezzi, RBrunetti, TCabri, WVesci, LPisano, C Exploring bis-(indolyl)methane moiety as an alternative and innovative CAP group in the design of histone deacetylase (HDAC) inhibitors. Bioorg Med Chem Lett19:2840-3 (2009) 
 
Histone deacetylase 5
Name:Histone deacetylase 5
Type:Enzyme
Mol. Mass.:121968.61
Organism:Homo sapiens (Human)
Description:Q9UQL6
Residue:1122
BDBM50297447
NameBDBM50297447
Synonyms:3-(4-(di(1H-indol-3-yl)methyl)phenyl)-N-hydroxyacrylamide ST-2887
TypeSmall organic molecule
Emp. Form.C26H21N3O2
Mol. Mass.407.4638
SMILESONC(=O)\C=C\c1ccc(cc1)C(c1c[nH]c2ccccc12)c1c[nH]c2ccccc12