Reaction Details
TargetHistone deacetylase 8
LigandBDBM50297446
Substrate/Competitorn/a
Meas. Tech.ChEMBL_585891 (CHEMBL1053562)
IC50 600.00±n/a nM
Citation Giannini, GMarzi, MMarzo, MDBattistuzzi, GPezzi, RBrunetti, TCabri, WVesci, LPisano, C Exploring bis-(indolyl)methane moiety as an alternative and innovative CAP group in the design of histone deacetylase (HDAC) inhibitors. Bioorg Med Chem Lett19:2840-3 (2009) 
 
Histone deacetylase 8
Name:Histone deacetylase 8
Type:Enzyme
Mol. Mass.:41749.60
Organism:Homo sapiens (Human)
Description:Q9BY41
Residue:377
BDBM50297446
NameBDBM50297446
Synonyms:CHEMBL561604 ST-5732
TypeSmall organic molecule
Emp. Form.C23H23N5O6
Mol. Mass.465.4586
SMILESONC(=O)CCCCCC(c1c[nH]c2ccc(cc12)[N+]([O-])=O)c1c[nH]c2ccc(cc12)[N+]([O-])=O