Reaction Details
TargetKappa-type opioid receptor
LigandBDBM50001709
Substrate/Competitorn/a
Meas. Tech.ChEMBL_586040 (CHEMBL1063597)
Ki 7.4±n/a nM
Citation Pelotte, ALSmith, RMAyestas, MDersch, CMBilsky, EJRothman, RBDeveau, AM Design, synthesis, and characterization of 6beta-naltrexol analogs, and their selectivity for in vitro opioid receptor subtypes. Bioorg Med Chem Lett19:2811-4 (2009) 
 
Kappa-type opioid receptor
Name:Kappa-type opioid receptor
Type:G Protein-Coupled Receptor (GPCR)
Mol. Mass.:42648.76
Organism:Homo sapiens (Human)
Description:P41145
Residue:380
BDBM50001709
NameBDBM50001709
Synonyms:4-cyclopropylmethyl-(13R)-12-oxa-4-azapentacyclo[9.6.1.01,13.05,17.07,18]octadeca-7,9,11(18)-triene-10,14,17-triol CHEMBL558140 | Naltrexone-6-beta-ol
TypeSmall organic molecule
Emp. Form.C20H25NO4
Mol. Mass.343.4168
SMILESO[C@@H]1CC[C@@]2(O)[C@H]3Cc4ccc(O)c5O[C@@H]1[C@]2(CCN3CC1CC1)c45