Reaction Details
TargetProgesterone receptor
LigandBDBM50298029
Substrate/Competitorn/a
Meas. Tech.ChEMBL_585095 (CHEMBL1054361)
IC50 20±n/a nM
Citation Thompson, SKWashburn, DGFrazee, JSMadauss, KPHoang, THLapinski, LGrygielko, ETGlace, LETrizna, WWilliams, SPDuraiswami, CBray, JDLaping, NJ Rational design of orally-active, pyrrolidine-based progesterone receptor partial agonists. Bioorg Med Chem Lett19:4777-80 (2009) 
 
Progesterone receptor
Name:Progesterone receptor
Type:Protein
Mol. Mass.:98979.52
Organism:Homo sapiens (Human)
Description:P06401
Residue:933
BDBM50298029
NameBDBM50298029
Synonyms:(S)-2-chloro-4-((2-chlorobenzyl)(1-isopropylpyrrolidin-3-yl)amino)benzonitrile | CHEMBL551081
TypeSmall organic molecule
Emp. Form.C21H23Cl2N3
Mol. Mass.388.333
SMILESCC(C)N1CC[C@@H](C1)N(Cc1ccccc1Cl)c1ccc(C#N)c(Cl)c1