Reaction Details
Target5-hydroxytryptamine receptor 2C
LigandBDBM50179073
Substrate/Competitorn/a
Meas. Tech.ChEMBL_588490 (CHEMBL1040388)
Ki 4±n/a nM
Citation Ahmed, AChoo, HCho, YSPark, WKPae, AN Identification of novel serotonin 2C receptor ligands by sequential virtual screening. Bioorg Med Chem17:4559-68 (2009) 
 
5-hydroxytryptamine receptor 2C
Name:5-hydroxytryptamine receptor 2C
Type:G Protein-Coupled Receptor (GPCR)
Mol. Mass.:51836.79
Organism:Homo sapiens (Human)
Description:P28335
Residue:458
BDBM50179073
NameBDBM50179073
Synonyms:(4R,9aR)-6-Cyclopropylmethoxymethyl-4-methyl-1,2,3,4,9,9a-hexahydro-2,4a,5-triaza-fluorene | CHEMBL203013
TypeSmall organic molecule
Emp. Form.C16H23N3O
Mol. Mass.273.3733
SMILESC[C@@H]1CNC[C@H]2Cc3ccc(COCC4CC4)nc3N12