Reaction Details
TargetTelomerase reverse transcriptase
LigandBDBM50298371
Substrate/Competitorn/a
Meas. Tech.ChEMBL_588495 (CHEMBL1041235)
IC50 3000±n/a nM
Citation Laronze-Cochard, MKim, YMBrassart, BRiou, JFLaronze, JYSapi, J Synthesis and biological evaluation of novel 4,5-bis(dialkylaminoalkyl)-substituted acridines as potent telomeric G-quadruplex ligands. Eur J Med Chem44:3880-8 (2009) 
 
Telomerase reverse transcriptase
Name:Telomerase reverse transcriptase
Type:PROTEIN
Mol. Mass.:127099.03
Organism:Homo sapiens (Human)
Description:ChEMBL_1447029
Residue:1132
BDBM50298371
NameBDBM50298371
Synonyms:2,2'-[4,5-Acridindiylbis(methyleneimino)]bis(N,N,N-trimethyl-3-oxopropylammonium)diiodide | CHEMBL575809
TypeSmall organic molecule
Emp. Form.C27H39N5O2
Mol. Mass.465.6298
SMILESC[N+](C)(C)CCC(=O)NCc1cccc2cc3cccc(CNC(=O)CC[N+](C)(C)C)c3nc12