Reaction Details
TargetCholecystokinin receptor type A
LigandBDBM50185262
Substrate/Competitorn/a
Meas. Tech.ChEMBL_587760 (CHEMBL1040411)
IC50 197±n/a nM
Citation Hadjipavlou-Litina, DBraiuca, PLassiani, LPavan, MVVarnavas, A 2D-QSAR and 3D-QSAR/CoMFA analyses of the N-terminal substituted anthranilic acid based CCK(1) receptor antagonists: 'Hic Rhodus, hic saltus'. Bioorg Med Chem17:5198-206 (2009) 
 
Cholecystokinin receptor type A
Name:Cholecystokinin receptor type A
Type:Enzyme Catalytic Domain
Mol. Mass.:49676.37
Organism:RAT
Description:Cholecystokinin central 0 RAT::P30551
Residue:444
BDBM50185262
NameBDBM50185262
Synonyms:(+/-)-2-(2-(1H-indole-2-carboxamido)benzamido)-3-phenylpropanoic acid 2-(2-(1H-indole-2-carboxamido)benzamido)-3-phenylpropanoic acid | CHEMBL202861
TypeSmall organic molecule
Emp. Form.C25H21N3O4
Mol. Mass.427.4519
SMILESOC(=O)C(Cc1ccccc1)NC(=O)c1ccccc1NC(=O)c1cc2ccccc2[nH]1