Reaction Details
TargetProstate-specific antigen
LigandBDBM50298718
Substrate/Competitorn/a
Meas. Tech.ChEMBL_588029 (CHEMBL1048364)
Ki 18.6±n/a nM
Citation LeBeau, AMBanerjee, SRPomper, MGMease, RCDenmeade, SR Optimization of peptide-based inhibitors of prostate-specific antigen (PSA) as targeted imaging agents for prostate cancer. Bioorg Med Chem17:4888-93 (2009) 
 
Prostate-specific antigen
Name:Prostate-specific antigen
Type:PROTEIN
Mol. Mass.:28747.53
Organism:Homo sapiens (Human)
Description:ChEMBL_959198
Residue:261
BDBM50298718
NameBDBM50298718
Synonyms:CHEMBL574926 | benzyl(2S,5S,8S,11S,14S)-11-((1H-imidazol-2-yl)methyl)-8-(4-aminobutyl)-14-formyl-1-hydroxy-5-(hydroxymethyl)-16-methyl-3,6,9,12-tetraoxo-4,7,10,13-tetraazaheptadecan-2-ylcarbamate
TypeSmall organic molecule
Emp. Form.C32H48N8O9
Mol. Mass.688.7717
SMILESCC(C)C[C@H](NC(=O)[C@H](Cc1ncc[nH]1)NC(=O)[C@H](CCCCN)NC(=O)[C@H](CO)NC(=O)[C@H](CO)NC(=O)OCc1ccccc1)C=O