Reaction Details
TargetProstate-specific antigen
LigandBDBM50298724
Substrate/Competitorn/a
Meas. Tech.ChEMBL_588029 (CHEMBL1048364)
Ki>50±n/a nM
Citation LeBeau, AMBanerjee, SRPomper, MGMease, RCDenmeade, SR Optimization of peptide-based inhibitors of prostate-specific antigen (PSA) as targeted imaging agents for prostate cancer. Bioorg Med Chem17:4888-93 (2009) 
 
Prostate-specific antigen
Name:Prostate-specific antigen
Type:PROTEIN
Mol. Mass.:28747.53
Organism:Homo sapiens (Human)
Description:ChEMBL_959198
Residue:261
BDBM50298724
NameBDBM50298724
Synonyms:CHEMBL574885 | benzyl(2S,5S,8S,11R,14S)-8-(4-aminobutyl)-11-(tert-butylthiomethyl)-14-formyl-1-hydroxy-5-(hydroxymethyl)-16-methyl-3,6,9,12-tetraoxo-4,7,10,13-tetraazaheptadecan-2-ylcarbamate
TypeSmall organic molecule
Emp. Form.C33H54N6O9S
Mol. Mass.710.882
SMILESCC(C)C[C@H](NC(=O)[C@H](CSC(C)(C)C)NC(=O)[C@H](CCCCN)NC(=O)[C@H](CO)NC(=O)[C@H](CO)NC(=O)OCc1ccccc1)C=O