Reaction Details
TargetProstate-specific antigen
LigandBDBM50298731
Substrate/Competitorn/a
Meas. Tech.ChEMBL_588029 (CHEMBL1048364)
Ki>100±n/a nM
Citation LeBeau, AMBanerjee, SRPomper, MGMease, RCDenmeade, SR Optimization of peptide-based inhibitors of prostate-specific antigen (PSA) as targeted imaging agents for prostate cancer. Bioorg Med Chem17:4888-93 (2009) 
 
Prostate-specific antigen
Name:Prostate-specific antigen
Type:PROTEIN
Mol. Mass.:28747.53
Organism:Homo sapiens (Human)
Description:ChEMBL_959198
Residue:261
BDBM50298731
NameBDBM50298731
Synonyms:CHEMBL583572 | benzyl(2S,5S,8S,11S,14S)-8-(4-aminobutyl)-14-formyl-1-hydroxy-5-(hydroxymethyl)-11,16-dimethyl-10-(naphthalen-2-yl)-3,6,9,12-tetraoxo-4,7,10,13-tetraazaheptadecan-2-ylcarbamate
TypeSmall organic molecule
Emp. Form.C39H52N6O9
Mol. Mass.748.865
SMILESCC(C)C[C@H](NC(=O)[C@H](C)N(C(=O)[C@H](CCCCN)NC(=O)[C@H](CO)NC(=O)[C@H](CO)NC(=O)OCc1ccccc1)c1ccc2ccccc2c1)C=O