Reaction Details
TargetProstate-specific antigen
LigandBDBM50298739
Substrate/Competitorn/a
Meas. Tech.ChEMBL_588029 (CHEMBL1048364)
Ki 7.5±n/a nM
Citation LeBeau, AMBanerjee, SRPomper, MGMease, RCDenmeade, SR Optimization of peptide-based inhibitors of prostate-specific antigen (PSA) as targeted imaging agents for prostate cancer. Bioorg Med Chem17:4888-93 (2009) 
 
Prostate-specific antigen
Name:Prostate-specific antigen
Type:PROTEIN
Mol. Mass.:28747.53
Organism:Homo sapiens (Human)
Description:ChEMBL_959198
Residue:261
BDBM50298739
NameBDBM50298739
Synonyms:CHEMBL583784 | benzyl(2S,5S,8S,11S,14S)-14-formyl-1-hydroxy-5-(hydroxymethyl)-11-isobutyl-16-methyl-8-(2-(methylthio)ethyl)-3,6,9,12-tetraoxo-4,7,10,13-tetraazaheptadecan-2-ylcarbamate
TypeSmall organic molecule
Emp. Form.C31H49N5O9S
Mol. Mass.667.814
SMILESCSCC[C@H](NC(=O)[C@H](CO)NC(=O)[C@H](CO)NC(=O)OCc1ccccc1)C(=O)N[C@@H](CC(C)C)C(=O)N[C@@H](CC(C)C)C=O