Reaction Details
TargetProstate-specific antigen
LigandBDBM50298744
Substrate/Competitorn/a
Meas. Tech.ChEMBL_588029 (CHEMBL1048364)
Ki 25.9±n/a nM
Citation LeBeau, AMBanerjee, SRPomper, MGMease, RCDenmeade, SR Optimization of peptide-based inhibitors of prostate-specific antigen (PSA) as targeted imaging agents for prostate cancer. Bioorg Med Chem17:4888-93 (2009) 
 
Prostate-specific antigen
Name:Prostate-specific antigen
Type:PROTEIN
Mol. Mass.:28747.53
Organism:Homo sapiens (Human)
Description:ChEMBL_959198
Residue:261
BDBM50298744
NameBDBM50298744
Synonyms:CHEMBL573414 | benzyl(2S,5S,8S,11S,14S)-14-formyl-1-hydroxy-5-(hydroxymethyl)-11-isobutyl-16-methyl-8-(2-(methylsulfinyl)ethyl)-3,6,9,12-tetraoxo-4,7,10,13-tetraazaheptadecan-2-ylcarbamate
TypeSmall organic molecule
Emp. Form.C31H49N5O10S
Mol. Mass.683.813
SMILESCC(C)C[C@H](NC(=O)[C@H](CC(C)C)NC(=O)[C@H](CCS(C)=O)NC(=O)[C@H](CO)NC(=O)[C@H](CO)NC(=O)OCc1ccccc1)C=O