Reaction Details
TargetDihydrofolate reductase
LigandBDBM25826
Substrate/Competitorn/a
Meas. Tech.ChEMBL_588095 (CHEMBL1044821)
IC50 33±n/a nM
Citation Paulsen, JLLiu, JBolstad, DBSmith, AEPriestley, NDWright, DLAnderson, AC In vitro biological activity and structural analysis of 2,4-diamino-5-(2'-arylpropargyl)pyrimidine inhibitors of Candida albicans. Bioorg Med Chem17:4866-72 (2009) 
 
Dihydrofolate reductase
Name:Dihydrofolate reductase
Type:Enzyme
Mol. Mass.:22141.77
Organism:Candida albicans
Description:C. albicans DHFR was expressed in E. coli BL21, and purified to homogeneity.
Residue:192
BDBM25826
NameBDBM25826
Synonyms:5-[(3R)-3-(3-methoxy-5-phenylphenyl)but-1-yn-1-yl]-6-methylpyrimidine-2,4-diamine | propargyl-based inhibitor, R-10a
TypeSmall organic molecule
Emp. Form.C22H22N4O
Mol. Mass.358.4363
SMILESCOc1cc(cc(c1)-c1ccccc1)[C@@H](C)C#Cc1c(C)nc(N)nc1N