Reaction Details
TargetMatrix metalloproteinase-16
LigandBDBM50299068
Substrate/Competitorn/a
Meas. Tech.ChEMBL_591606 (CHEMBL1042359)
IC50 31000±n/a nM
Citation Nuti, EPanelli, LCasalini, FAvramova, SIOrlandini, ESantamaria, SNencetti, STuccinardi, TMartinelli, ACercignani, GD'Amelio, NMaiocchi, AUggeri, FRossello, A Design, synthesis, biological evaluation, and NMR studies of a new series of arylsulfones as selective and potent matrix metalloproteinase-12 inhibitors. J Med Chem52:6347-61 (2009) 
 
Matrix metalloproteinase-16
Name:Matrix metalloproteinase-16
Type:PROTEIN
Mol. Mass.:69536.76
Organism:Homo sapiens (Human)
Description:ChEMBL_799129
Residue:607
BDBM50299068
NameBDBM50299068
Synonyms:CHEMBL575895 | N-Hydroxy-2-(4-methoxy-benzenesulfonyl)benzamide
TypeSmall organic molecule
Emp. Form.C14H13NO5S
Mol. Mass.307.322
SMILESCOc1ccc(cc1)S(=O)(=O)c1ccccc1C(=O)NO