Reaction Details
TargetRetinoic acid receptor RXR-alpha
LigandBDBM50032675
Substrate/Competitorn/a
Meas. Tech.ChEMBL_589773 (CHEMBL1061277)
EC50 52±n/a nM
Citation Wagner, CEJurutka, PWMarshall, PAGroy, TLvan der Vaart, AZiller, JWFurmick, JKGraeber, MEMatro, EMiguel, BVTran, ITKwon, JTedeschi, JNMoosavi, SDanishyar, APhilp, JSKhamees, ROJackson, JNGrupe, DKBadshah, SLHart, JW Modeling, synthesis and biological evaluation of potential retinoid X receptor (RXR) selective agonists: novel analogues of 4-[1-(3,5,5,8,8-pentamethyl-5,6,7,8-tetrahydro-2-naphthyl)ethynyl]benzoic acid (bexarotene). J Med Chem52:5950-66 (2009) 
 
Retinoic acid receptor RXR-alpha
Name:Retinoic acid receptor RXR-alpha
Type:PROTEIN
Mol. Mass.:50820.38
Organism:Homo sapiens (Human)
Description:ChEMBL_1456363
Residue:462
BDBM50032675
NameBDBM50032675
Synonyms:4-[1-(3,5,5,8,8-pentamethyl-5,6,7,8-tetrahydronaphthalen-2-yl)vinyl]benzoic acid CHEMBL1023 | p-(1-(5,6,7,8-Tetrahydro-3,5,5,8,8-pentamethyl-2-naphthyl)vinyl)benzoic acid
TypeSmall organic molecule
Emp. Form.C24H28O2
Mol. Mass.348.4779
SMILESCc1cc2c(cc1C(=C)c1ccc(cc1)C(O)=O)C(C)(C)CCC2(C)C