Reaction Details
TargetReceptor-type tyrosine-protein phosphatase epsilon
LigandBDBM50299462
Substrate/Competitorn/a
Meas. Tech.ChEMBL_590759 (CHEMBL1050901)
Ki 45000±n/a nM
Citation Vidovic, DSchürer, SC Knowledge-based characterization of similarity relationships in the human protein-tyrosine phosphatase family for rational inhibitor design. J Med Chem52:6649-59 (2009) 
 
Receptor-type tyrosine-protein phosphatase epsilon
Name:Receptor-type tyrosine-protein phosphatase epsilon
Type:Protein
Mol. Mass.:80646.31
Organism:Homo sapiens (Human)
Description:P23469
Residue:700
BDBM50299462
NameBDBM50299462
Synonyms:2-(3-(dihydroxymethyl)naphthalen-2-ylamino)-2-oxoacetic acid | CHEMBL573989
TypeSmall organic molecule
Emp. Form.C13H11NO5
Mol. Mass.261.2301
SMILESOC(O)c1cc2ccccc2cc1NC(=O)C(O)=O