Reaction Details
TargetReceptor-type tyrosine-protein phosphatase epsilon
LigandBDBM50118796
Substrate/Competitorn/a
Meas. Tech.ChEMBL_590759 (CHEMBL1050901)
Ki 66000±n/a nM
Citation Vidovic, DSchürer, SC Knowledge-based characterization of similarity relationships in the human protein-tyrosine phosphatase family for rational inhibitor design. J Med Chem52:6649-59 (2009) 
 
Receptor-type tyrosine-protein phosphatase epsilon
Name:Receptor-type tyrosine-protein phosphatase epsilon
Type:Protein
Mol. Mass.:80646.31
Organism:Homo sapiens (Human)
Description:P23469
Residue:700
BDBM50118796
NameBDBM50118796
Synonyms:6-(OXALYL-AMINO)-1H-INDOLE-5-CARBOXYLIC ACID CHEMBL342478
TypeSmall organic molecule
Emp. Form.C11H8N2O5
Mol. Mass.248.1916
SMILESOC(=O)C(=O)Nc1cc2[nH]ccc2cc1C(O)=O