Reaction Details
TargetReceptor-type tyrosine-protein phosphatase alpha
LigandBDBM50299462
Substrate/Competitorn/a
Meas. Tech.ChEMBL_590760 (CHEMBL1037598)
Ki 190000±n/a nM
Citation Vidovic, DSchürer, SC Knowledge-based characterization of similarity relationships in the human protein-tyrosine phosphatase family for rational inhibitor design. J Med Chem52:6649-59 (2009) 
 
Receptor-type tyrosine-protein phosphatase alpha
Name:Receptor-type tyrosine-protein phosphatase alpha
Type:Enzyme
Mol. Mass.:90719.02
Organism:Homo sapiens (Human)
Description:P18433
Residue:802
BDBM50299462
NameBDBM50299462
Synonyms:2-(3-(dihydroxymethyl)naphthalen-2-ylamino)-2-oxoacetic acid | CHEMBL573989
TypeSmall organic molecule
Emp. Form.C13H11NO5
Mol. Mass.261.2301
SMILESOC(O)c1cc2ccccc2cc1NC(=O)C(O)=O