Reaction Details
TargetReceptor-type tyrosine-protein phosphatase C
LigandBDBM50118749
Substrate/Competitorn/a
Meas. Tech.ChEMBL_590755 (CHEMBL1050897)
Ki 210000±n/a nM
Citation Vidovic, DSchürer, SC Knowledge-based characterization of similarity relationships in the human protein-tyrosine phosphatase family for rational inhibitor design. J Med Chem52:6649-59 (2009) 
 
Receptor-type tyrosine-protein phosphatase C
Name:Receptor-type tyrosine-protein phosphatase C
Type:Protein
Mol. Mass.:147474.19
Organism:Homo sapiens (Human)
Description:P08575
Residue:1306
BDBM50118749
NameBDBM50118749
Synonyms:2-(Oxalyl-amino)-thiophene-3-carboxylic acid CHEMBL342612
TypeSmall organic molecule
Emp. Form.C7H5NO5S
Mol. Mass.215.183
SMILESOC(=O)C(=O)Nc1sccc1C(O)=O