Reaction Details
TargetTyrosine-protein phosphatase non-receptor type 6
LigandBDBM50118744
Substrate/Competitorn/a
Meas. Tech.ChEMBL_590757 (CHEMBL1050899)
Ki 350000±n/a nM
Citation Vidovic, DSchürer, SC Knowledge-based characterization of similarity relationships in the human protein-tyrosine phosphatase family for rational inhibitor design. J Med Chem52:6649-59 (2009) 
 
Tyrosine-protein phosphatase non-receptor type 6
Name:Tyrosine-protein phosphatase non-receptor type 6
Type:Protein
Mol. Mass.:67570.41
Organism:Homo sapiens (Human)
Description:P29350
Residue:595
BDBM50118744
NameBDBM50118744
Synonyms:2-(Oxalyl-amino)-4,7-dihydro-5H-thieno[2,3-c]pyran-3-carboxylic acid CHEMBL138806
TypeSmall organic molecule
Emp. Form.C10H9NO6S
Mol. Mass.271.247
SMILESOC(=O)C(=O)Nc1sc2COCCc2c1C(O)=O