Reaction Details
TargetReceptor-type tyrosine-protein phosphatase F
LigandBDBM50118744
Substrate/Competitorn/a
Meas. Tech.ChEMBL_590756 (CHEMBL1050898)
Ki 360000±n/a nM
Citation Vidovic, DSchürer, SC Knowledge-based characterization of similarity relationships in the human protein-tyrosine phosphatase family for rational inhibitor design. J Med Chem52:6649-59 (2009) 
 
Receptor-type tyrosine-protein phosphatase F
Name:Receptor-type tyrosine-protein phosphatase F
Type:Protein
Mol. Mass.:212869.85
Organism:Homo sapiens (Human)
Description:P10586
Residue:1907
BDBM50118744
NameBDBM50118744
Synonyms:2-(Oxalyl-amino)-4,7-dihydro-5H-thieno[2,3-c]pyran-3-carboxylic acid CHEMBL138806
TypeSmall organic molecule
Emp. Form.C10H9NO6S
Mol. Mass.271.247
SMILESOC(=O)C(=O)Nc1sc2COCCc2c1C(O)=O