Reaction Details
TargetReceptor-type tyrosine-protein phosphatase F
LigandBDBM50118796
Substrate/Competitorn/a
Meas. Tech.ChEMBL_590756 (CHEMBL1050898)
Ki 550000±n/a nM
Citation Vidovic, DSchürer, SC Knowledge-based characterization of similarity relationships in the human protein-tyrosine phosphatase family for rational inhibitor design. J Med Chem52:6649-59 (2009) 
 
Receptor-type tyrosine-protein phosphatase F
Name:Receptor-type tyrosine-protein phosphatase F
Type:Protein
Mol. Mass.:212869.85
Organism:Homo sapiens (Human)
Description:P10586
Residue:1907
BDBM50118796
NameBDBM50118796
Synonyms:6-(OXALYL-AMINO)-1H-INDOLE-5-CARBOXYLIC ACID CHEMBL342478
TypeSmall organic molecule
Emp. Form.C11H8N2O5
Mol. Mass.248.1916
SMILESOC(=O)C(=O)Nc1cc2[nH]ccc2cc1C(O)=O