Reaction Details
TargetNeuromedin-K receptor
LigandBDBM50291261
Substrate/Competitorn/a
Meas. Tech.ChEMBL_590803 (CHEMBL1037641)
Ki 0.8±n/a nM
Citation Malherbe, PKratzeisen, CMarcuz, AZenner, MTNettekoven, MHRatni, HWettstein, JGBissantz, C Identification of a critical residue in the transmembrane domain 2 of tachykinin neurokinin 3 receptor affecting the dissociation kinetics and antagonism mode of osanetant (SR 142801) and piperidine-based structures. J Med Chem52:7103-12 (2009) 
 
Neuromedin-K receptor
Name:Neuromedin-K receptor
Type:Enzyme Catalytic Domain
Mol. Mass.:49456.44
Organism:GUINEA PIG
Description:Neurokinin NK3 TACR3 GUINEA PIG::P30098
Residue:440
BDBM50291261
NameBDBM50291261
Synonyms:(S)-(+)-N-((3-[1-Benzoyl-3-(3,4-dichlorophenyl)piperidin-3-yl]prop-1-yl)-4-phenylpiperidin-4-yl)-N-methylacetamine CHEMBL346178 OSANETANT SR-14280 | SR-142801
TypeSmall organic molecule
Emp. Form.C35H41Cl2N3O2
Mol. Mass.606.625
SMILESCN(C(C)=O)C1(CCN(CCC[C@@]2(CCCN(C2)C(=O)c2ccccc2)c2ccc(Cl)c(Cl)c2)CC1)c1ccccc1