Reaction Details
TargetNeuromedin-K receptor
LigandBDBM50299468
Substrate/Competitorn/a
Meas. Tech.ChEMBL_590803 (CHEMBL1037641)
Ki 1.8±n/a nM
Citation Malherbe, PKratzeisen, CMarcuz, AZenner, MTNettekoven, MHRatni, HWettstein, JGBissantz, C Identification of a critical residue in the transmembrane domain 2 of tachykinin neurokinin 3 receptor affecting the dissociation kinetics and antagonism mode of osanetant (SR 142801) and piperidine-based structures. J Med Chem52:7103-12 (2009) 
 
Neuromedin-K receptor
Name:Neuromedin-K receptor
Type:Enzyme Catalytic Domain
Mol. Mass.:49456.44
Organism:GUINEA PIG
Description:Neurokinin NK3 TACR3 GUINEA PIG::P30098
Residue:440
BDBM50299468
NameBDBM50299468
Synonyms:2-(3,4-dichlorophenyl)-N-(4-fluoro-3-trifluoromethylbenzyl)-2,N-dimethyl-4-[4-(2-oxo-pyrrolidin-1-yl)-piperidin-1-yl]-butyramide | CHEMBL565894
TypeSmall organic molecule
Emp. Form.C29H33Cl2F4N3O2
Mol. Mass.602.491
SMILESCN(Cc1ccc(F)c(c1)C(F)(F)F)C(=O)C(C)(CCN1CCC(CC1)N1CCCC1=O)c1ccc(Cl)c(Cl)c1