Reaction Details
TargetDelta-type opioid receptor
LigandBDBM50299559
Substrate/Competitorn/a
Meas. Tech.ChEMBL_591861 (CHEMBL1045065)
Ki 0.536±n/a nM
Citation Berezowska, IChung, NNLemieux, CWilkes, BCSchiller, PW Agonist vs antagonist behavior of delta opioid peptides containing novel phenylalanine analogues in place of Tyr(1). J Med Chem52:6941-5 (2009) 
 
Delta-type opioid receptor
Name:Delta-type opioid receptor
Type:G Protein-Coupled Receptor (GPCR)
Mol. Mass.:40465.04
Organism:Rattus norvegicus (rat)
Description:Competition binding assays were using CHO-K1 cell membranes expressing the opioid receptor.
Residue:372
BDBM50299559
NameBDBM50299559
Synonyms:CHEMBL583285 | H-4'-[N-((4'-phenyl)phenethyl)carboxamido]phenylalanine-Tic-Phe-OH
TypeSmall organic molecule
Emp. Form.C43H42N4O5
Mol. Mass.694.8174
SMILESN[C@@H](Cc1ccc(cc1)C(=O)NCCc1ccc(cc1)-c1ccccc1)C(=O)N1Cc2ccccc2C[C@H]1C(=O)N[C@@H](Cc1ccccc1)C(O)=O