Reaction Details
TargetDelta-type opioid receptor
LigandBDBM50060080
Substrate/Competitorn/a
Meas. Tech.ChEMBL_591861 (CHEMBL1045065)
Ki 242±n/a nM
Citation Berezowska, IChung, NNLemieux, CWilkes, BCSchiller, PW Agonist vs antagonist behavior of delta opioid peptides containing novel phenylalanine analogues in place of Tyr(1). J Med Chem52:6941-5 (2009) 
 
Delta-type opioid receptor
Name:Delta-type opioid receptor
Type:G Protein-Coupled Receptor (GPCR)
Mol. Mass.:40465.04
Organism:Rattus norvegicus (rat)
Description:Competition binding assays were using CHO-K1 cell membranes expressing the opioid receptor.
Residue:372
BDBM50060080
NameBDBM50060080
Synonyms:2-({2-[(R)-2-Amino-3-(4-hydroxy-2,6-dimethyl-phenyl)-propionyl]-1,2,3,4-tetrahydro-isoquinoline-3-carbonyl}-amino)-propionic acid | CHEMBL485576
TypeSmall organic molecule
Emp. Form.C19H20N2O4
Mol. Mass.340.3731
SMILESN[C@@H](Cc1ccc(O)cc1)C(=O)N1Cc2ccccc2C[C@H]1C(O)=O