Reaction Details
TargetMu-type opioid receptor
LigandBDBM50299565
Substrate/Competitorn/a
Meas. Tech.ChEMBL_591862 (CHEMBL1045066)
Ki 1360±n/a nM
Citation Berezowska, IChung, NNLemieux, CWilkes, BCSchiller, PW Agonist vs antagonist behavior of delta opioid peptides containing novel phenylalanine analogues in place of Tyr(1). J Med Chem52:6941-5 (2009) 
 
Mu-type opioid receptor
Name:Mu-type opioid receptor
Type:G Protein-Coupled Receptor (GPCR)
Mol. Mass.:44503.11
Organism:Rattus norvegicus (rat)
Description:Competition binding assays were carried out using membrane preparations from transfected HN9.10 cells that constitutively expressed the mu opioid receptor.
Residue:398
BDBM50299565
NameBDBM50299565
Synonyms:(S)-2-((S)-2-amino-3-(4-hydroxy-2,6-dimethylphenyl)propanoyl)-1,2,3,4-tetrahydroisoquinoline-3-carboxylic acid H-2',6'-dimethyltyrosine-Tic-OH | H-Dmt-Tic-OH
TypeSmall organic molecule
Emp. Form.C21H24N2O4
Mol. Mass.368.4263
SMILESCc1cc(O)cc(C)c1C[C@H](N)C(=O)N1Cc2ccccc2C[C@H]1C(O)=O