Reaction Details
TargetCyclin-dependent kinase 5 activator 1
LigandBDBM50414918
Substrate/Competitorn/a
Meas. Tech.ChEMBL_590314 (CHEMBL1054437)
IC50 5.3±n/a nM
Citation Kaller, MRZhong, WHenley, CMagal, ENguyen, TPowers, DRzasa, RMWang, WXiong, XNorman, MH Design and synthesis of 6-oxo-1,6-dihydropyridines as CDK5 inhibitors. Bioorg Med Chem Lett19:6591-4 (2009) 
 
Cyclin-dependent kinase 5 activator 1
Name:Cyclin-dependent kinase 5 activator 1
Type:Protein Complex
Mol. Mass.:n/a
Description:n/a
Components:This complex has 2 components.
Component 1
Name:Cyclin-dependent kinase 5
Synonyms:CDK5 CDKN5 Cyclin-dependent kinase 5 (CDK5/ p25) Cyclin-dependent-like kinase 5 PSSALRE Tau protein kinase II catalytic subunit
Type:Enzyme Subunit
Mol. Mass.:33308.61
Organism:Homo sapiens (Human)
Description:n/a
Residue:292
Component 2
Name:Cyclin-dependent kinase 5 activator 1
Synonyms:CD5R1_HUMAN CDK5R1 Cyclin-dependent kinase 5 (CDK5/p25) NCK5A p35
Type:Enzyme Subunit
Mol. Mass.:34077.43
Organism:Homo sapiens (Human)
Description:Q15078
Residue:307
BDBM50414918
NameBDBM50414918
Synonyms:CHEMBL567832
TypeSmall organic molecule
Emp. Form.C26H24N2O6S2
Mol. Mass.524.609
SMILESCCOC(=O)c1cc(-c2csc(CS(=O)(=O)c3ccccc3)n2)c(=O)[nH]c1COCc1ccccc1