Reaction Details
TargetHistone deacetylase 8
LigandBDBM50299972
Substrate/Competitorn/a
Meas. Tech.ChEMBL_593050 (CHEMBL1039566)
Ki 6.59E3±n/a nM
Citation He, BVelaparthi, SPieffet, GPennington, CMahesh, AHolzle, DLBrunsteiner, Mvan Breemen, RBlond, SYPetukhov, PA Binding ensemble profiling with photoaffinity labeling (BEProFL) approach: mapping the binding poses of HDAC8 inhibitors. J Med Chem52:7003-13 (2009) 
 
Histone deacetylase 8
Name:Histone deacetylase 8
Type:Enzyme
Mol. Mass.:41749.60
Organism:Homo sapiens (Human)
Description:Q9BY41
Residue:377
BDBM50299972
NameBDBM50299972
Synonyms:CHEMBL585164 | Octanedioic Acid [4-(3-Azido-5-azidomethylbenzyloxy)phenyl]-amide Hydroxyamide
TypeSmall organic molecule
Emp. Form.C22H26N8O4
Mol. Mass.466.493
SMILESONC(=O)CCCCCCC(=O)Nc1ccc(OCc2cc(CN=[N+]=[N-])cc(c2)N=[N+]=[N-])cc1