Reaction Details
TargetE3 ubiquitin-protein ligase Mdm2
LigandBDBM50300114
Substrate/Competitorn/a
Meas. Tech.ChEMBL_593610 (CHEMBL1039715)
IC50 16.4±n/a nM
Citation Yu, SQin, DShangary, SChen, JWang, GDing, KMcEachern, DQiu, SNikolovska-Coleska, ZMiller, RKang, SYang, DWang, S Potent and orally active small-molecule inhibitors of the MDM2-p53 interaction. J Med Chem52:7970-3 (2009) 
 
E3 ubiquitin-protein ligase Mdm2
Name:E3 ubiquitin-protein ligase Mdm2
Type:Oncoprotein
Mol. Mass.:55196.54
Organism:Homo sapiens (Human)
Description:Q00987
Residue:491
BDBM50300114
NameBDBM50300114
Synonyms:(2'R,3S,4'S,5'R)-6-chloro-4'-(3-chloro-2-fluorophenyl)-N-((S)-3,4-dihydroxybutyl)-2'-neopentyl-2-oxospiro[indoline-3,3'-pyrrolidine]-5'-carboxamide | CHEMBL578028
TypeSmall organic molecule
Emp. Form.C27H32Cl2FN3O4
Mol. Mass.552.465
SMILESCC(C)(C)C[C@H]1N[C@H]([C@H](c2cccc(Cl)c2F)[C@@]11C(=O)Nc2cc(Cl)ccc12)C(=O)NCC[C@H](O)CO