Reaction Details
TargetTyrosine-protein kinase JAK2
LigandBDBM50300197
Substrate/Competitorn/a
Meas. Tech.ChEMBL_592720 (CHEMBL1042391)
Ki 4.8E2±n/a nM
Citation Wang, TDuffy, JPWang, JHalas, SSalituro, FGPierce, ACZuccola, HJBlack, JRHogan, JKJepson, SShlyakter, DMahajan, SGu, YHoock, TWood, MFurey, BFFrantz, JDDauffenbach, LMGermann, UAFan, BNamchuk, MBennani, YLLedeboer, MW Janus kinase 2 inhibitors. Synthesis and characterization of a novel polycyclic azaindole. J Med Chem52:7938-41 (2009) 
 
Tyrosine-protein kinase JAK2
Name:Tyrosine-protein kinase JAK2
Type:Protein
Mol. Mass.:130684.68
Organism:Homo sapiens (Human)
Description:O60674
Residue:1132
BDBM50300197
NameBDBM50300197
Synonyms:4-phenyl-7H-pyrrolo[2,3-d]pyrimidine | CHEMBL578974
TypeSmall organic molecule
Emp. Form.C12H9N3
Mol. Mass.195.22
SMILESc1cc2c(ncnc2[nH]1)-c1ccccc1