Reaction Details
TargetDelta-type opioid receptor
LigandBDBM50017236
Substrate/Competitorn/a
Meas. Tech.ChEMBL_591228 (CHEMBL1056133)
Ki 1350±n/a nM
Citation Zhang, YLee, YSRothman, RBDersch, CMDeschamps, JRJacobson, AERice, KC Probes for narcotic receptor mediated phenomena. 39. Enantiomeric N-substituted benzofuro[2,3-c]pyridin-6-ols: synthesis and topological relationship to oxide-bridged phenylmorphans. J Med Chem52:7570-9 (2009) 
 
Delta-type opioid receptor
Name:Delta-type opioid receptor
Type:G Protein-Coupled Receptor (GPCR)
Mol. Mass.:40382.98
Organism:Homo sapiens (Human)
Description:Competition binding assays were carried out using membrane preparations from transfected HN9.10 cells that constitutively expressed the delta opioid receptor.
Residue:372
BDBM50017236
NameBDBM50017236
Synonyms:(4aS,9aR)-4a-Ethyl-2-methyl-1,2,3,4,4a,9a-hexahydro-benzo[4,5]furo[2,3-c]pyridin-6-ol CHEMBL430441
TypeSmall organic molecule
Emp. Form.C14H19NO2
Mol. Mass.233.3062
SMILESCC[C@@]12CCN(C)C[C@@H]1Oc1ccc(O)cc21