Reaction Details
TargetDelta-type opioid receptor
LigandBDBM50300365
Substrate/Competitorn/a
Meas. Tech.ChEMBL_591228 (CHEMBL1056133)
Ki 2690±n/a nM
Citation Zhang, YLee, YSRothman, RBDersch, CMDeschamps, JRJacobson, AERice, KC Probes for narcotic receptor mediated phenomena. 39. Enantiomeric N-substituted benzofuro[2,3-c]pyridin-6-ols: synthesis and topological relationship to oxide-bridged phenylmorphans. J Med Chem52:7570-9 (2009) 
 
Delta-type opioid receptor
Name:Delta-type opioid receptor
Type:G Protein-Coupled Receptor (GPCR)
Mol. Mass.:40382.98
Organism:Homo sapiens (Human)
Description:Competition binding assays were carried out using membrane preparations from transfected HN9.10 cells that constitutively expressed the delta opioid receptor.
Residue:372
BDBM50300365
NameBDBM50300365
Synonyms:4aR,9aS-(+)-cis-4a-Ethyl-2-phenylethyl-1,2,3,4,4a,9a-hexahydrobenzofuro[2,3-c]pyridin-6-ol | CHEMBL568076
TypeSmall organic molecule
Emp. Form.C21H25NO2
Mol. Mass.323.4287
SMILESCC[C@]12CCN(CCc3ccccc3)C[C@H]1Oc1ccc(O)cc21