Reaction Details
TargetDelta-type opioid receptor
LigandBDBM50300369
Substrate/Competitorn/a
Meas. Tech.ChEMBL_591228 (CHEMBL1056133)
Ki 443±n/a nM
Citation Zhang, YLee, YSRothman, RBDersch, CMDeschamps, JRJacobson, AERice, KC Probes for narcotic receptor mediated phenomena. 39. Enantiomeric N-substituted benzofuro[2,3-c]pyridin-6-ols: synthesis and topological relationship to oxide-bridged phenylmorphans. J Med Chem52:7570-9 (2009) 
 
Delta-type opioid receptor
Name:Delta-type opioid receptor
Type:G Protein-Coupled Receptor (GPCR)
Mol. Mass.:40382.98
Organism:Homo sapiens (Human)
Description:Competition binding assays were carried out using membrane preparations from transfected HN9.10 cells that constitutively expressed the delta opioid receptor.
Residue:372
BDBM50300369
NameBDBM50300369
Synonyms:4aS,9aR,2'S-(-)-cis-2-(2'-Hydroxy-2-phenylethyl)-4a-ethyl-1,2,3,4,4a,9a-hexahydrobenzofuro[2,3-c]pyridin-6-ol | CHEMBL568309
TypeSmall organic molecule
Emp. Form.C21H25NO3
Mol. Mass.339.4281
SMILESCC[C@@]12CCN(C[C@@H](O)c3ccccc3)C[C@@H]1Oc1ccc(O)cc21