Reaction Details
TargetKappa-type opioid receptor
LigandBDBM50300366
Substrate/Competitorn/a
Meas. Tech.ChEMBL_591229 (CHEMBL1056134)
Ki>1000±n/a nM
Citation Zhang, YLee, YSRothman, RBDersch, CMDeschamps, JRJacobson, AERice, KC Probes for narcotic receptor mediated phenomena. 39. Enantiomeric N-substituted benzofuro[2,3-c]pyridin-6-ols: synthesis and topological relationship to oxide-bridged phenylmorphans. J Med Chem52:7570-9 (2009) 
 
Kappa-type opioid receptor
Name:Kappa-type opioid receptor
Type:G Protein-Coupled Receptor (GPCR)
Mol. Mass.:42648.76
Organism:Homo sapiens (Human)
Description:P41145
Residue:380
BDBM50300366
NameBDBM50300366
Synonyms:4aR,9aS-(+)-cis-4a-Ethyl-2-methyl-1,2,3,4,4a,9a-hexahydrobenzofuro[2,3-c]pyridin-6-ol | CHEMBL582929
TypeSmall organic molecule
Emp. Form.C14H19NO2
Mol. Mass.233.3062
SMILESCC[C@]12CCN(C)C[C@H]1Oc1ccc(O)cc21