Reaction Details
TargetSodium-dependent serotonin transporter
LigandBDBM50300524
Substrate/Competitorn/a
Meas. Tech.ChEMBL_592525 (CHEMBL1044081)
IC50 834±n/a nM
Citation Mahaney, PEKim, CYCoghlan, RDCohn, STHeffernan, GDHuselton, CATerefenko, EAVu, ATZhang, PBurroughs, KDCosmi, SABray, JAJohnston, GHDeecher, DCTrybulski, EJ Structure-activity relationships of the 1-amino-3-(1H-indol-1-yl)-3-phenylpropan-2-ol series of monoamine reuptake inhibitors. Bioorg Med Chem Lett19:5807-10 (2009) 
 
Sodium-dependent serotonin transporter
Name:Sodium-dependent serotonin transporter
Type:Multi-pass membrane protein
Mol. Mass.:70322.51
Organism:Homo sapiens (Human)
Description:P31645
Residue:630
BDBM50300524
NameBDBM50300524
Synonyms:(1S,2R)-1-(3-ethyl-1H-indol-1-yl)-1-(3-fluorophenyl)-3-(methylamino)propan-2-ol | CHEMBL576758
TypeSmall organic molecule
Emp. Form.C20H23FN2O
Mol. Mass.326.4078
SMILESCCc1cn([C@H]([C@H](O)CNC)c2cccc(F)c2)c2ccccc12