Reaction Details
TargetCytochrome P450 3A4
LigandBDBM50300543
Substrate/Competitorn/a
Meas. Tech.ChEMBL_588720 (CHEMBL1059329)
Ki 70±n/a nM
Citation McNulty, JNair, JJSingh, MCrankshaw, DJHolloway, AC Structure-activity studies on seco-pancratistatin analogs: potent inhibitors of human cytochrome P450 3A4. Bioorg Med Chem Lett19:5607-12 (2009) 
 
Cytochrome P450 3A4
Name:Cytochrome P450 3A4
Type:Enzyme
Mol. Mass.:57349.57
Organism:Homo sapiens (Human)
Description:n/a
Residue:503
BDBM50300543
NameBDBM50300543
Synonyms:((4S,5S)-5-((1R,2R)-3-benzamido-2-(benzo[d][1,3]dioxol-5-yl)-1-(methoxymethoxy)propyl)-2,2-dimethyl-1,3-dioxolan-4-yl)methyl 4-methylbenzenesulfonate | CHEMBL573665
TypeSmall organic molecule
Emp. Form.C32H37NO10S
Mol. Mass.627.702
SMILESCOCO[C@H]([C@@H](CNC(=O)c1ccccc1)c1ccc2OCOc2c1)[C@@H]1OC(C)(C)O[C@H]1COS(=O)(=O)c1ccc(C)cc1