Reaction Details
TargetReceptor-type tyrosine-protein kinase FLT3
LigandBDBM50300691
Substrate/Competitorn/a
Meas. Tech.ChEMBL_589520 (CHEMBL1056849)
Kd 1.6±n/a nM
Citation Chao, QSprankle, KGGrotzfeld, RMLai, AGCarter, TAVelasco, AMGunawardane, RNCramer, MDGardner, MFJames, JZarrinkar, PPPatel, HKBhagwat, SS Identification of N-(5-tert-butyl-isoxazol-3-yl)-N'-{4-[7-(2-morpholin-4-yl-ethoxy)imidazo[2,1-b][1,3]benzothiazol-2-yl]phenyl}urea dihydrochloride (AC220), a uniquely potent, selective, and efficacious FMS-like tyrosine kinase-3 (FLT3) inhibitor. J Med Chem52:7808-16 (2009) 
 
Receptor-type tyrosine-protein kinase FLT3
Name:Receptor-type tyrosine-protein kinase FLT3
Type:Enzyme
Mol. Mass.:112888.62
Organism:Homo sapiens (Human)
Description:P36888
Residue:993
BDBM50300691
NameBDBM50300691
Synonyms:Benzo[d]imidazo[2,1-b]thiazole-2-carboxylic acid {4-[3-(5-tert-butyl-isoxazol-3-yl)-ureido]-phenyl}-amide CHEMBL575925
TypeSmall organic molecule
Emp. Form.C24H22N6O3S
Mol. Mass.474.535
SMILESCC(C)(C)c1cc(NC(=O)Nc2ccc(NC(=O)c3cn4c(n3)sc3ccccc43)cc2)no1