Reaction Details
TargetReceptor-type tyrosine-protein kinase FLT3
LigandBDBM50300696
Substrate/Competitorn/a
Meas. Tech.ChEMBL_589520 (CHEMBL1056849)
Kd 0.990000±n/a nM
Citation Chao, QSprankle, KGGrotzfeld, RMLai, AGCarter, TAVelasco, AMGunawardane, RNCramer, MDGardner, MFJames, JZarrinkar, PPPatel, HKBhagwat, SS Identification of N-(5-tert-butyl-isoxazol-3-yl)-N'-{4-[7-(2-morpholin-4-yl-ethoxy)imidazo[2,1-b][1,3]benzothiazol-2-yl]phenyl}urea dihydrochloride (AC220), a uniquely potent, selective, and efficacious FMS-like tyrosine kinase-3 (FLT3) inhibitor. J Med Chem52:7808-16 (2009) 
 
Receptor-type tyrosine-protein kinase FLT3
Name:Receptor-type tyrosine-protein kinase FLT3
Type:Enzyme
Mol. Mass.:112888.62
Organism:Homo sapiens (Human)
Description:P36888
Residue:993
BDBM50300696
NameBDBM50300696
Synonyms:CHEMBL574349 | N-(5-tert-Butyl-isoxazol-3-yl)-N'-{4-[7-(3-morpholin-4-ylpropoxy)imidazo[2,1-b][1,3]benzothiazol-2-yl]phenyl}urea
TypeSmall organic molecule
Emp. Form.C30H34N6O4S
Mol. Mass.574.694
SMILESCC(C)(C)c1cc(NC(=O)Nc2ccc(cc2)-c2cn3c(n2)sc2cc(OCCCN4CCOCC4)ccc32)no1