Reaction Details
TargetNuclear factor NF-kappa-B p105 subunit
LigandBDBM50300847
Substrate/Competitorn/a
Meas. Tech.ChEMBL_598993 (CHEMBL1041917)
IC50 19000±n/a nM
Citation Kobayashi, TYoshimori, AKino, KKomori, RMiyazawa, HTanuma, SI A new small molecule that directly inhibits the DNA binding of NF-kappaB. Bioorg Med Chem17:5293-7 (2009) 
 
Nuclear factor NF-kappa-B p105 subunit
Name:Nuclear factor NF-kappa-B p105 subunit
Type:Protein
Mol. Mass.:105329.57
Organism:Homo sapiens (Human)
Description:P19838
Residue:968
BDBM50300847
NameBDBM50300847
Synonyms:4,6-dichloro-N-m-tolyl-1,3,5-triazin-2-amine | CHEMBL583591
TypeSmall organic molecule
Emp. Form.C10H8Cl2N4
Mol. Mass.255.103
SMILESCc1cccc(Nc2nc(Cl)nc(Cl)n2)c1