Reaction Details
TargetNuclear factor NF-kappa-B p105 subunit
LigandBDBM50300851
Substrate/Competitorn/a
Meas. Tech.ChEMBL_598993 (CHEMBL1041917)
IC50 35200±n/a nM
Citation Kobayashi, TYoshimori, AKino, KKomori, RMiyazawa, HTanuma, SI A new small molecule that directly inhibits the DNA binding of NF-kappaB. Bioorg Med Chem17:5293-7 (2009) 
 
Nuclear factor NF-kappa-B p105 subunit
Name:Nuclear factor NF-kappa-B p105 subunit
Type:Protein
Mol. Mass.:105329.57
Organism:Homo sapiens (Human)
Description:P19838
Residue:968
BDBM50300851
NameBDBM50300851
Synonyms:4,6-dichloro-N-(4-ethoxyphenyl)-1,3,5-triazin-2-amine | CHEMBL577701
TypeSmall organic molecule
Emp. Form.C11H10Cl2N4O
Mol. Mass.285.129
SMILESCCOc1ccc(Nc2nc(Cl)nc(Cl)n2)cc1