Reaction Details
TargetAdenosine receptor A3
LigandBDBM50300871
Substrate/Competitorn/a
Meas. Tech.ChEMBL_599661 (CHEMBL1042905)
Ki 3450±n/a nM
Citation El-Tayeb, AIqbal, JBehrenswerth, ARomio, MSchneider, MZimmermann, HSchrader, JMüller, CE Nucleoside-5'-monophosphates as prodrugs of adenosine A2A receptor agonists activated by ecto-5'-nucleotidase. J Med Chem52:7669-77 (2009) 
 
Adenosine receptor A3
Name:Adenosine receptor A3
Type:G Protein-Coupled Receptor (GPCR)
Mol. Mass.:36197.32
Organism:Homo sapiens (Human)
Description:P0DMS8
Residue:318
BDBM50300871
NameBDBM50300871
Synonyms:(2R,3R,4S,5R)-2-(2-(2-(1,3-dioxolan-2-yl)ethylthio)-6-amino-9H-purin-9-yl)-5-(hydroxymethyl)tetrahydrofuran-3,4-diol | CHEMBL578145
TypeSmall organic molecule
Emp. Form.C15H21N5O6S
Mol. Mass.399.422
SMILESNc1nc(SCCC2OCCO2)nc2n(cnc12)[C@@H]1O[C@H](CO)[C@@H](O)[C@H]1O