Reaction Details
TargetAdenosine receptor A3
LigandBDBM50300877
Substrate/Competitorn/a
Meas. Tech.ChEMBL_599661 (CHEMBL1042905)
Ki 1720±n/a nM
Citation El-Tayeb, AIqbal, JBehrenswerth, ARomio, MSchneider, MZimmermann, HSchrader, JMüller, CE Nucleoside-5'-monophosphates as prodrugs of adenosine A2A receptor agonists activated by ecto-5'-nucleotidase. J Med Chem52:7669-77 (2009) 
 
Adenosine receptor A3
Name:Adenosine receptor A3
Type:G Protein-Coupled Receptor (GPCR)
Mol. Mass.:36197.32
Organism:Homo sapiens (Human)
Description:P0DMS8
Residue:318
BDBM50300877
NameBDBM50300877
Synonyms:(2R,3R,4S,5R)-2-(6-amino-2-(cyclohexylmethylthio)-9H-purin-9-yl)-5-(hydroxymethyl)tetrahydrofuran-3,4-diol | CHEMBL568009
TypeSmall organic molecule
Emp. Form.C17H25N5O4S
Mol. Mass.395.477
SMILESNc1nc(SCC2CCCCC2)nc2n(cnc12)[C@@H]1O[C@H](CO)[C@@H](O)[C@H]1O