Reaction Details
TargetAdenosine receptor A2a
LigandBDBM50300875
Substrate/Competitorn/a
Meas. Tech.ChEMBL_599660 (CHEMBL1042904)
Ki 8560±n/a nM
Citation El-Tayeb, AIqbal, JBehrenswerth, ARomio, MSchneider, MZimmermann, HSchrader, JMüller, CE Nucleoside-5'-monophosphates as prodrugs of adenosine A2A receptor agonists activated by ecto-5'-nucleotidase. J Med Chem52:7669-77 (2009) 
 
Adenosine receptor A2a
Name:Adenosine receptor A2a
Type:G Protein-Coupled Receptor (GPCR)
Mol. Mass.:45015.65
Organism:Rattus norvegicus (rat)
Description:Rat A2A receptors expressed in CHO cells.
Residue:410
BDBM50300875
NameBDBM50300875
Synonyms:(2R,3R,4S,5R)-2-(6-amino-2-(cyclopentylthio)-9H-purin-9-yl)-5-(hydroxymethyl)tetrahydrofuran-3,4-diol | CHEMBL576883
TypeSmall organic molecule
Emp. Form.C15H21N5O4S
Mol. Mass.367.423
SMILESNc1nc(SC2CCCC2)nc2n(cnc12)[C@@H]1O[C@H](CO)[C@@H](O)[C@H]1O