Reaction Details
TargetAdenosine receptor A2a
LigandBDBM50300879
Substrate/Competitorn/a
Meas. Tech.ChEMBL_599660 (CHEMBL1042904)
Ki 2940±n/a nM
Citation El-Tayeb, AIqbal, JBehrenswerth, ARomio, MSchneider, MZimmermann, HSchrader, JMüller, CE Nucleoside-5'-monophosphates as prodrugs of adenosine A2A receptor agonists activated by ecto-5'-nucleotidase. J Med Chem52:7669-77 (2009) 
 
Adenosine receptor A2a
Name:Adenosine receptor A2a
Type:G Protein-Coupled Receptor (GPCR)
Mol. Mass.:45015.65
Organism:Rattus norvegicus (rat)
Description:Rat A2A receptors expressed in CHO cells.
Residue:410
BDBM50300879
NameBDBM50300879
Synonyms:(2R,3R,4S,5R)-2-(6-amino-2-(prop-2-ynylthio)-9H-purin-9-yl)-5-(hydroxymethyl)tetrahydrofuran-3,4-diol | CHEMBL578819
TypeSmall organic molecule
Emp. Form.C13H15N5O4S
Mol. Mass.337.354
SMILESNc1nc(SCC#C)nc2n(cnc12)[C@@H]1O[C@H](CO)[C@@H](O)[C@H]1O