Reaction Details
TargetAdenosine receptor A2a
LigandBDBM50300882
Substrate/Competitorn/a
Meas. Tech.ChEMBL_599659 (CHEMBL1042903)
Ki 1350±n/a nM
Citation El-Tayeb, AIqbal, JBehrenswerth, ARomio, MSchneider, MZimmermann, HSchrader, JMüller, CE Nucleoside-5'-monophosphates as prodrugs of adenosine A2A receptor agonists activated by ecto-5'-nucleotidase. J Med Chem52:7669-77 (2009) 
 
Adenosine receptor A2a
Name:Adenosine receptor A2a
Type:G Protein-Coupled Receptor (GPCR)
Mol. Mass.:45015.65
Organism:Rattus norvegicus (rat)
Description:Rat A2A receptors expressed in CHO cells.
Residue:410
BDBM50300882
NameBDBM50300882
Synonyms:(2R,3R,4S,5R)-2-(6-amino-2-(propylthio)-9H-purin-9-yl)-5-(hydroxymethyl)tetrahydrofuran-3,4-diol | CHEMBL577902
TypeSmall organic molecule
Emp. Form.C13H19N5O4S
Mol. Mass.341.386
SMILESCCCSc1nc(N)c2ncn([C@@H]3O[C@H](CO)[C@@H](O)[C@H]3O)c2n1