Reaction Details
TargetcGMP-specific 3',5'-cyclic phosphodiesterase
LigandBDBM50300981
Substrate/Competitorn/a
Meas. Tech.ChEMBL_597959 (CHEMBL1042744)
IC50 1.7±n/a nM
Citation Hughes, ROWalker, JKRogier, DJHeasley, SEBlevis-Bal, RMBenson, AGJacobsen, EJCubbage, JWFobian, YMOwen, DRFreskos, JNMolyneaux, JMBrown, DLAcker, BAMaddux, TMTollefson, MBMoon, JBMischke, BVRumsey, JMZheng, YMacInnes, ABond, BRYu, Y Optimization of the aminopyridopyrazinones class of PDE5 inhibitors: discovery of 3-[(trans-4-hydroxycyclohexyl)amino]-7-(6-methoxypyridin-3-yl)-1-(2-propoxyethyl)pyrido[3,4-b]pyrazin-2(1H)-one. Bioorg Med Chem Lett19:5209-13 (2009) 
 
cGMP-specific 3',5'-cyclic phosphodiesterase
Name:cGMP-specific 3',5'-cyclic phosphodiesterase
Type:Protein
Mol. Mass.:99975.83
Organism:Homo sapiens (Human)
Description:O76074
Residue:875
BDBM50300981
NameBDBM50300981
Synonyms:7-(6-methoxypyridin-3-yl)-3-(2-oxo-2-(piperazin-1-yl)ethylamino)-1-(2-propoxyethyl)pyrido[3,4-b]pyrazin-2(1H)-one | CHEMBL571913
TypeSmall organic molecule
Emp. Form.C24H31N7O4
Mol. Mass.481.5474
SMILESCCCOCCn1c2cc(ncc2nc(NCC(=O)N2CCNCC2)c1=O)-c1ccc(OC)nc1