Reaction Details
TargetcGMP-specific 3',5'-cyclic phosphodiesterase
LigandBDBM50300988
Substrate/Competitorn/a
Meas. Tech.ChEMBL_597959 (CHEMBL1042744)
IC50 0.340000±n/a nM
Citation Hughes, ROWalker, JKRogier, DJHeasley, SEBlevis-Bal, RMBenson, AGJacobsen, EJCubbage, JWFobian, YMOwen, DRFreskos, JNMolyneaux, JMBrown, DLAcker, BAMaddux, TMTollefson, MBMoon, JBMischke, BVRumsey, JMZheng, YMacInnes, ABond, BRYu, Y Optimization of the aminopyridopyrazinones class of PDE5 inhibitors: discovery of 3-[(trans-4-hydroxycyclohexyl)amino]-7-(6-methoxypyridin-3-yl)-1-(2-propoxyethyl)pyrido[3,4-b]pyrazin-2(1H)-one. Bioorg Med Chem Lett19:5209-13 (2009) 
 
cGMP-specific 3',5'-cyclic phosphodiesterase
Name:cGMP-specific 3',5'-cyclic phosphodiesterase
Type:Protein
Mol. Mass.:99975.83
Organism:Homo sapiens (Human)
Description:O76074
Residue:875
BDBM50300988
NameBDBM50300988
Synonyms:(S)-3-(2-hydroxypropylamino)-7-(6-methoxypyridin-3-yl)-1-(2-propoxyethyl)pyrido[2,3-b]pyrazin-2(1H)-one | CHEMBL584056
TypeSmall organic molecule
Emp. Form.C21H27N5O4
Mol. Mass.413.4702
SMILESCCCOCCn1c2cc(cnc2nc(NC[C@H](C)O)c1=O)-c1ccc(OC)nc1